{"text_format":"1","workbook":"xlsx","n_sheets":10,"sheets":["Instructions","Demande","Annexe A","Annexe B","Annexe C","Annexe D","Annexe E","Annexe F","Annexe G","Annexe H"],"not_rendered":{"charts":0,"images":7,"macros":0,"external_links":2,"defined_names":23,"comments":2,"pivot_tables":0},"unopened":[],"bounds":{"document_bytes":16777216,"sheet_cells":100000,"rows_first":2000,"rows_last":500,"rows_between":2000,"halvings":0,"cell_chars":16384,"cell_head_chars":4096},"cells_cut":0,"cells_raw":0,"read":"whole","date_system":"1900"}

{"sheet":"Instructions","index":0,"n_rows":37,"n_cols":14,"rows_kept":37,"cut":false,"hidden":false,"merged":[[6,0,6,33],[0,0,0,12],[0,13,0,33],[1,0,1,33],[2,0,2,33],[4,0,4,33],[3,0,3,33],[5,0,5,33],[9,0,9,37],[11,0,11,37],[7,0,7,33],[8,0,8,33],[37,0,37,33],[31,1,31,33],[28,0,28,33],[33,0,33,37],[35,0,35,37],[36,1,36,29],[30,0,30,33],[27,0,27,33],[25,0,25,33],[26,0,26,33],[10,0,10,33],[12,0,12,33],[24,0,24,33],[21,0,21,33],[13,0,13,33],[14,0,14,37],[23,0,23,33],[19,0,19,33],[20,0,20,33],[15,0,15,33],[22,0,22,33],[18,0,18,33],[16,0,16,33],[17,0,17,33]]}
[null,null,null,null,null,null,null,null,null,null,null,null,null,"Production de titres multimédias\n(volet sociétés spécialisées)\nVersion : 2023-09-22"]
["Demande d'attestation de société spécialisée et de travaux de production"]
["Mise en garde\n\nAvant de remplir ce formulaire, vous devez, au préalable, remplir l'annexe F pour déterminer si la société peut se qualifier au volet des sociétés spécialisées."]
["Ce document indique la procédure à suivre pour obtenir une attestation de société spécialisée et de travaux de production requises pour réclamer le crédit d'impôt pour une société spécialisée dans la production de titres multimédias. La société doit par la suite réclamer ce crédit d'impôt à Revenu Québec en produisant sa déclaration de revenus CO-17 et l’annexe CO-1029.8.36.PM dans le délai prévu."]
["Afin de pouvoir demander ce crédit d'impôt, une société doit obtenir une attestation de société spécialisée certifiant qu'au moins 75 % de ses activités qu'elle exerce au Québec, pour une année d’imposition donnée, ont consisté à produire des titres multimédias admissibles pour elle-même ou pour le compte d’autres personnes et, le cas échéant, à effectuer des recherches scientifiques et du développement expérimental s’y rapportant. "]
["Nous vous conseillons fortement de consulter la fiche détaillée disponible sur notre site Internet avant de remplir ce formulaire. Assurez-vous d’utiliser la dernière version à jour du formulaire.  Par ailleurs, vous pouvez consulter le chapitre VI, de l'annexe A de la Loi concernant les paramètres sectoriels de certaines mesures fiscales qui inclut tous les paramètres sectoriels applicables à cette mesure."]
[]
["Dépôt d'une demande d'attestation annuelle à Investissement Québec"]
["La société doit présenter sa demande d’attestation annuelle à Investissement Québec avant la fin du 15e mois suivant la fin de l’exercice financier de la société. Si la demande d’attestation annuelle est présentée après cette date, mais avant l’expiration du délai de 18 mois suivant la fin de l’exercice financier de la société, Investissement Québec peut, de manière discrétionnaire, accepter la demande d’attestation si elle est d’avis que les motifs de retard sont raisonnables et justifient une telle demande « tardive ». Par conséquent, si vous êtes dans cette situation, veuillez joindre un document faisant état de vos motifs de retard."]
[]
["Toutefois, une demande d'attestation déposée à Investissement Québec après l'expiration du délai de 18 mois sera refusée."]
[]
["Production des documents à Revenu Québec"]
["La société doit présenter sa demande de crédit d’impôt et les attestations à Revenu Québec à la plus tardive des dates suivantes :\n   - Le dernier jour du 18e mois suivant la fin de l’exercice financier visé de la société;\n   - Le dernier jour de la période de 3 mois suivant la date de délivrance des attestations d’Investissement Québec."]
[]
["De plus, seules les demandes complètes seront traitées. Toute demande reçue avant la fin de l'exercice financier visé sera retournée à l'expéditeur.\n\nUne demande complète inclut :\n   - Demande d'attestation de société spécialisée et de travaux de production dûment complétée et signée;\n   - Annexes A, B, C, D, E, F, G et H (le cas échéant);\n   - Factures ou contrats si des travaux de production sont réclamés à l'annexe B ou C."]
["Notez qu’Investissement Québec indique la date de réception de demande complète sur les attestations. Par conséquent il est de votre responsabilité de vous assurer de respecter les délais prescrits par Revenu Québec puisque la société pourrait perdre  le droit de recevoir son crédit d’impôt pour une année donnée, le cas échéant."]
["* Veuillez noter que les documents exigés aux fins d’une demande complète ne dispense pas la société de l’obligation de fournir les documents mentionnés à la section 6 de la demande d’attestation de société spécialisée et de travaux de production. "]
[]
["ENTENTE D'ÉCHANGE DE RENSEIGNEMENTS"]
{"$rows_left_out":18}
{"sheet":"Demande","index":1,"n_rows":116,"n_cols":34,"rows_kept":116,"cut":false,"hidden":false,"merged":[[0,0,0,12],[4,0,4,33],[1,0,1,33],[3,0,3,33],[2,0,2,33],[0,13,0,33],[24,0,24,25],[22,0,22,33],[23,0,23,33],[5,0,5,33],[6,0,6,33],[14,0,14,33],[15,0,15,33],[8,0,8,7],[8,10,8,17],[8,20,8,27],[8,29,8,33],[9,0,9,7],[9,10,9,17],[9,20,9,27],[9,29,9,33],[13,0,13,25],[7,0,7,33],[10,0,10,33],[49,1,49,33],[24,26,24,33],[33,27,33,32],[30,0,30,25],[30,27,30,32],[31,0,31,25],[31,27,31,32],[27,0,27,33],[28,0,28,33],[29,0,29,25],[29,26,29,33],[25,0,25,25],[25,26,25,33],[26,0,26,25],[26,26,26,33],[36,26,36,33],[43,16,43,21],[39,0,39,25],[39,27,39,33],[40,0,40,25],[40,27,40,32],[42,0,42,33],[43,0,43,7],[43,8,43,13],[94,1,94,30],[75,0,75,33],[81,1,81,30],[82,0,82,33],[63,1,63,25],[62,27,62,28],[62,30,62,31],[62,1,62,26],[65,1,65,25],[72,1,72,25],[84,0,84,33],[66,0,66,33],[67,1,67,25],[68,0,68,33],[91,1,91,31],[92,0,92,33],[93,1,93,31],[116,0,116,33],[100,0,100,33],[101,0,101,33],[115,0,115,20],[114,0,114,20],[114,23,114,33],[102,0,103,0],[102,1,103,33],[104,0,104,33],[105,0,105,33],[106,0,106,33],[115,23,115,33],[107,0,107,33],[109,1,109,33],[110,0,110,33],[111,1,111,33],[112,0,112,33],[113,0,113,33],[108,0,108,33],[11,0,11,33],[12,0,12,33],[13,26,13,33],[34,0,34,33],[41,0,41,33],[37,0,37,25],[37,27,37,32],[38,0,38,25],[38,27,38,32],[35,0,35,33],[36,0,36,25],[32,0,32,25],[32,27,32,33],[33,0,33,25],[16,1,16,25],[17,1,17,25],[17,26,17,33],[18,1,18,25],[18,26,18,33],[19,1,19,25],[19,26,19,33],[20,1,20,25],[21,1,21,25],[21,26,21,33],[59,0,59,33],[96,1,98,30],[99,0,99,33],[90,0,90,33],[61,1,61,33],[64,0,64,33],[89,1,89,30],[85,1,85,30],[86,1,86,30],[88,1,88,30],[87,0,87,33],[83,1,83,30],[80,0,80,33],[76,0,76,33],[77,1,77,33],[78,1,78,33],[79,0,79,33],[95,0,95,33],[74,0,74,33],[69,1,69,25],[70,0,70,33],[71,1,71,25],[60,0,60,33],[73,0,73,33],[16,26,16,33],[20,26,20,33],[58,0,58,14],[56,0,56,22],[56,23,56,33],[55,0,55,33],[58,15,58,22],[57,0,57,33],[44,16,44,21],[44,22,44,33],[45,0,45,33],[46,0,46,33],[50,1,50,33],[51,1,51,33],[52,1,52,33],[53,1,53,33],[54,1,54,33],[48,0,48,33],[44,14,44,15],[44,0,44,7],[44,8,44,13],[43,14,43,15],[43,22,43,33],[47,0,47,33]]}
[null,null,null,null,null,null,null,null,null,null,null,null,null,"Production de titres multimédias\n(volet sociétés spécialisées)\nVersion : 2023-09-22"]
["Demande d'attestation de société spécialisée et de travaux de production"]
["Avant de remplir le formulaire, veuillez lire l'onglet Directives"]
[]
["1. IDENTIFICATION DE LA SOCIÉTÉ"]
["Nom de la société"]
[]
[]
["NEQ (numéro d'entreprise du Qc)",null,null,null,null,null,null,null,null,null,"Numéro d'entreprise IQ*",null,null,null,null,null,null,null,null,null,"Numéro de dossier IQ*",null,null,null,null,null,null,null,null,"Date d'incorporation"]
[]
["*Il s'agit du numéro d'entreprise ou de dossier attribué par Investissement Québec pour le crédit d'impôt pour un société spécialisée dans la production de titres multimédias. Non requis lors de la première demande. Dans le cas d'une deuxième demande, vous retracerez ce numéro sur la correspondance reçue de la part d'IQ."]
[]
["Adresse du site Internet de la société"]
[]
[]
["Adresse de tous les établissements"]
[1]
[2]
[3]
[4]
{"$rows_left_out":97}
{"sheet":"Annexe A","index":2,"n_rows":3987,"n_cols":10,"rows_kept":3987,"cut":false,"hidden":false,"merged":[[0,1,0,2],[0,3,0,9],[1,1,1,9],[2,1,2,9],[4,2,4,7],[3,1,3,9],[11,1,11,9],[14,9,17,9],[14,4,16,4],[14,5,16,5],[12,3,12,9],[13,1,13,9],[14,1,16,1],[14,6,16,6],[14,8,16,8],[14,2,17,2],[14,3,16,3],[14,7,16,7],[5,1,5,9],[7,3,7,9],[9,3,9,9],[10,3,10,9],[6,3,6,9],[8,1,8,9],[34,1,34,9],[35,1,35,9],[30,1,30,9],[31,1,31,9],[32,1,32,9],[33,1,33,9]]}
[null,null,null,"Production de titres multimédias\n(volet sociétés spécialisées)\nVersion : 2023-09-22"]
[null,"Annexe A - Demande d'attestation de travaux de production\nTravaux de production admissibles réalisés par les employés de la société"]
[null,"(L'Annexe A fait partie intégrante de la présente demande.)"]
[]
[null,"Nom de la société :",{"$f":"IF(Demande!A7=\"\",\"\",Demande!A7)","v":""}]
[]
[null,"Exercice financier du :",{"$f":"IF(Demande!I44=\"\",\"\",Demande!I44)","v":""}]
[null,null,"(aaaa-mm-jj)"]
[]
[null,"au :",{"$f":"IF(Demande!Q44=\"\",\"\",Demande!Q44)","v":""}]
[null,null,"(aaaa-mm-jj)"]
[]
[null,"Numéro de dossier IQ :",{"$f":"IF(Demande!U10=\"\",\"\",Demande!U10)","v":""}]
[]
[null,"Nom de l'employé\nComme suit : Nom(1 espace) Prénom","N.A.S.\n999 999 999","Titre du poste1 en français\n(pour chacun de ces postes, remplissez l'annexe E.)","Nombre d'heures consacrées aux travaux de production2","Nombre d'heures totales travaillées pour le compte de la société au cours de l'exercice financier3","Pourcentage d'admissibilité réclamé4","Salaire brut versé durant l'exercice financier5","Pourcentage du temps travaillé hors Québec6","Commentaires"]
[]
[]
[]
[{"$f":"ROW()","v":19}]
[]
{"$rows_left_out":3968}
{"sheet":"Annexe B","index":3,"n_rows":3993,"n_cols":10,"rows_kept":3993,"cut":false,"hidden":false,"merged":[[22,8,24,8],[22,9,24,9],[22,1,24,1],[21,1,21,3],[22,3,24,3],[22,2,24,2],[22,5,24,5],[0,1,0,2],[8,1,8,3],[3,1,3,3],[0,3,0,9],[1,1,1,9],[2,1,2,9],[4,1,4,9],[5,1,5,9],[33,1,33,9],[34,1,34,9],[35,1,35,9],[36,1,36,9],[6,1,6,3],[7,2,7,5],[17,7,17,9],[11,1,11,3],[22,6,24,6],[19,1,19,8],[16,1,16,3],[14,1,14,3],[18,7,18,9],[22,4,24,4],[22,7,24,7],[20,1,20,9]]}
[null,null,null,"Production de titres multimédias\n(volet sociétés spécialisées)\nVersion : 2023-09-22"]
[null,"Annexe B - Demande d'attestation de travaux de production\nTravaux de production admissibles réalisés par des personnes ou sociétés de personnes ayant un lien de dépendance au moment de la conclusion du contrat"]
[null,"(L'Annexe B fait partie intégrante de la présente demande.)"]
[]
[null,"Veuillez utiliser une annexe par personne ou société de personnes sous-traitante ayant un lien de dépendance."]
[null,"Lorsqu'un sous-traitant a présenté plusieurs factures, vous devez détailler chaque facture dans la présente demande (une facture par ligne)."]
[]
[null,"Nom de la société :",{"$f":"IF(Demande!A7=\"\",\"\",Demande!A7)","v":""}]
[]
[null,"Exercice financier du :",{"$f":"IF(Demande!I44=\"\",\"\",Demande!I44)","v":""}]
[null,null,"(aaaa-mm-jj)"]
[]
[null,"au :",{"$f":"IF(Demande!Q44=\"\",\"\",Demande!Q44)","v":""}]
[null,null,"(aaaa-mm-jj)"]
[]
[null,"Numéro de dossier IQ :",{"$f":"IF(Demande!U10=\"\",\"\",Demande!U10)","v":""}]
[]
[null,"Nom du titre","Nom et coordonnées de la personne ou de la société de personnes sous-traitante ayant un lien de dépendance","Services rendus à l'égard du titre admissible (en français)","Montant total de la facture","Date de la facture","Numéro de la facture"]
[]
[]
{"$rows_left_out":3974}
{"sheet":"Annexe C","index":4,"n_rows":4002,"n_cols":9,"rows_kept":4002,"cut":false,"hidden":false,"merged":[[39,1,39,8],[40,1,40,8],[17,6,19,6],[7,1,7,7],[14,3,14,7],[8,3,8,7],[17,4,19,4],[37,1,37,8],[38,1,38,8],[16,1,16,7],[10,1,10,7],[9,3,9,7],[11,3,11,7],[12,3,12,7],[15,1,15,7],[13,1,13,7],[0,3,0,8],[0,1,0,2],[6,2,6,7],[1,1,1,8],[2,1,2,8],[3,1,3,8],[5,1,5,7],[4,1,4,8],[17,2,20,2],[17,1,19,1],[17,7,19,7],[17,8,20,8],[17,3,19,3],[17,5,19,5]]}
[null,null,null,"Production de titres multimédias\n(volet sociétés spécialisées)\nVersion : 2023-09-22"]
[null,"Annexe C - Demande d'attestation de travaux de production\nTravaux de production admissibles effectués par des personnes ou sociétés de personnes sans lien de dépendance"]
[null,"(L'Annexe C fait partie intégrante de la présente demande.)"]
[]
[null,"Lorsqu'un sous-traitant a effectué des travaux qui ont été facturés à plus d'une reprise, le détail de chaque facture (ou chaque contrat) doit être inscrit dans la présente annexe (une facture par ligne)."]
[]
[null,"Nom de la société :",{"$f":"IF(Demande!A7=\"\",\"\",Demande!A7)","v":""}]
[]
[null,"Exercice financier du :",{"$f":"IF(Demande!I44=\"\",\"\",Demande!I44)","v":""}]
[null,null,"(aaaa-mm-jj)"]
[]
[null,"au :",{"$f":"IF(Demande!Q44=\"\",\"\",Demande!Q44)","v":""}]
[null,null,"(aaaa-mm-jj)"]
[]
[null,"Numéro de dossier IQ : ",{"$f":"IF(Demande!U10=\"\",\"\",Demande!U10)","v":""}]
[]
[]
[null,"Titre(s) admissible(s) pour lequel ou lesquels les services sont rendus","Nom et coordonnées des personnes ou sociétés de personnes sans lien de dépendance","Montant total de la facture1","Date de la facture2","Numéro de la facture","Pourcentage de travaux admissibles réclamé3","Services rendus à l'égard du ou des titre(s) multimédia(s) admissible(s)4 (en français)","Commentaires"]
[]
[]
{"$rows_left_out":3983}
{"sheet":"Annexe D","index":5,"n_rows":3993,"n_cols":15,"rows_kept":3993,"cut":false,"hidden":false,"merged":[[0,8,0,9],[3,8,3,14],[5,3,5,6],[8,3,8,6],[6,3,6,6],[1,2,1,7],[10,7,12,7],[3,2,3,7],[10,3,13,3],[2,2,2,7],[10,6,12,6],[10,4,12,4],[10,5,12,5],[10,1,12,1],[10,2,12,2],[10,10,12,10],[10,11,12,11],[0,12,0,14],[10,12,12,12],[10,13,12,13],[10,14,12,14],[9,11,9,14],[1,8,1,14],[2,8,2,14],[10,8,12,8],[4,3,4,6],[0,4,0,7],[10,9,12,9],[9,2,9,7]]}
[null,null,null,null,"Production de titres multimédias\n(volet sociétés spécialisées)\nVersion : 2023-09-22",null,null,null,null,null,null,null,"Production de titres multimédias\n(volet sociétés spécialisées)\nVersion : 2023-09-22"]
[null,null,"Annexe D - Demande d'attestation de travaux de production\nListe des titres et des informations connexes"]
[null,null,"(L'Annexe D fait partie intégrante de la présente demande.)"]
[null,null,"Vous devez dresser la liste de tous les titres multimédias à l’égard desquels des travaux de production ont été effectués pendant l’année d’imposition visée. Cette liste doit refléter tant les titres que la société a développés entièrement que ceux à l’égard desquels elle n’a contribué que partiellement (partie de titre). Veuillez inclure également les titres dont la date de début des travaux de production est antérieure à la date de début de l’année d’imposition visée et à l’égard desquels des travaux de production ont été effectués pendant cette année d’imposition.",null,null,null,null,null,"Annexe D (suite) - Demande d'attestation de travaux de production\nListe des titres et des informations connexes\n(L'Annexe D (suite) fait partie intégrante de la présente demande.)"]
[null,null,"Nom de la société :",{"$f":"IF(Demande!A7=\"\",\"\",Demande!A7)","v":""}]
[]
[]
[null,null,"Numéro de dossier IQ : ",{"$f":"IF(Demande!U10=\"\",\"\",Demande!U10)","v":""}]
[]
[null,null,null,null,null,null,null,null,null,null,null,"Présence et importance des composantes multimédias"]
[null,"Nom du titre","Nom et adresse du client, le cas échéant","Support électronique du titre (CD, Internet, console, etc.)","S'il s'agit d'un site Internet, indiquez l'adresse du site Internet.","Date de début des travaux de production (date à laquelle les premiers frais de production ont été engagés)","Date de la première commercialisation\n(voir le commentaire au triangle rouge)","Revenus bruts générés durant l'année d'imposition visée","Disponibilité du titre en français au moment de la date de la première commercialisation? (Oui, non ou en partie).","Sommaire du contenu \n(histoire, scénario, etc.)","Décrire l'interactivité entre l'utilisateur et le contenu (description détaillée) ","Son\n (évaluer et décrire le niveau d'importance)","Texte\n (évaluer et décrire le niveau d'importance)","Images fixes\n (évaluer et décrire le niveau d'importance)","Images animées\n (évaluer et décrire le niveau d'importance)"]
[]
[]
[]
[{"$f":"ROW()","v":15}]
[{"$f":"ROW()","v":16}]
[{"$f":"ROW()","v":17}]
[{"$f":"ROW()","v":18}]
[{"$f":"ROW()","v":19}]
[{"$f":"ROW()","v":20}]
{"$rows_left_out":3974}
{"sheet":"Annexe E","index":6,"n_rows":46,"n_cols":4,"rows_kept":46,"cut":false,"hidden":false,"merged":[[31,0,31,1],[13,0,13,3],[33,0,33,1],[34,0,34,1],[44,0,44,1],[40,0,40,1],[41,0,41,1],[42,0,42,1],[43,0,43,1],[35,0,35,1],[36,0,36,1],[37,0,37,1],[38,0,38,1],[39,0,39,1],[0,1,0,3],[1,0,1,3],[2,0,2,3],[3,0,3,3],[21,0,21,1],[4,0,4,3],[11,1,11,4],[7,0,7,1],[9,2,9,3],[6,0,6,2],[16,0,16,1],[17,0,17,1],[18,0,18,1],[19,0,19,1],[10,0,10,4],[12,0,12,4],[8,2,8,4],[45,0,45,3],[14,0,14,3],[15,0,15,1],[20,0,20,1],[22,0,22,1],[23,0,23,1],[24,0,24,1],[25,0,25,1],[26,0,26,1],[27,0,27,1],[28,0,28,1],[29,0,29,1],[30,0,30,1],[8,0,8,1],[32,0,32,1]]}
[null,"Production de titres multimédias\n(volet sociétés spécialisées)\nVersion : 2023-09-22"]
["\nAnnexe E - Demande d'attestation de travaux de production\nDescription de poste"]
["(L'Annexe E fait partie intégrante de la présente demande.)"]
["Vous devez fournir une description de poste pour chaque type de poste visé par votre demande d'attestation. Ne donnez qu'une seule description de poste pour tous les employés occupant exactement le même poste. Chaque poste doit être suffisamment décrit et doit présenter toutes les tâches qui le composent. Veuillez accorder un pourcentage représentatif du temps consacré à chaque tâche d'un poste donné   (ex. : ne pas inscrire une tâche représentant 100 % du temps de l'employé)."]
["Dans le cadre du traitement de la demande, Investissement Québec peut exiger que des feuilles de temps, rapport de facturation ou tout autre document appuyant les descriptions de postes lui soient présentés afin de justifier les postes réclamés. Pour plus de détails, consultez nos « Directives relatives aux descriptions de tâches dans les demandes d'attestations d'admissibilité » sur notre site Internet à l'adresse suivante : http://www.investquebec.com/documents/fr/publications/NouvellesLignesDirectrices_MesuresFiscales.pdf"]
[]
["Nom de la société",null,null,"Numéro de dossier IQ "]
[{"$f":"IF(Demande!A7=\"\",\"\",Demande!A7)","v":""},null,null,{"$f":"IF(Demande!U10=\"\",\"\",Demande!U10)","v":""}]
["Titre du poste ",null,"Supérieur immédiat "]
[]
["Titulaire(s)"]
[]
["Raison d'être du poste"]
[]
[]
["Description détaillée des tâches réalisées par l'employé durant l'exercice financier",null,"Temps\n consacré à\nces activités (%)","Réservé à IQ"]
[]
[]
[]
[]
{"$rows_left_out":27}
{"sheet":"Annexe F","index":7,"n_rows":39,"n_cols":4,"rows_kept":39,"cut":false,"hidden":false,"merged":[[0,1,0,3],[38,0,38,3],[10,0,10,3],[32,0,32,1],[34,0,34,1],[36,0,36,3],[9,0,9,3],[11,0,11,3],[8,0,8,1],[1,0,1,3],[2,0,2,3],[3,0,3,3],[4,0,4,3]]}
[null,"Production de titres multimédias\n(volet sociétés spécialisées)\nVersion : 2023-09-22"]
["Annexe F - Demande d'attestation de société spécialisée\nPourcentage d'activités exercées au Québec à l'égard de la \nproduction de titres multimédias admissibles"]
["(L'Annexe F fait partie intégrante de la présente demande.)"]
["Une attestation de société spécialisée est délivrée à une société lorsqu'au moins 75 % des activités qu'elle exerce au Québec, pour une année d’imposition donnée, consiste à produire des titres admissibles pour elle-même ou pour le compte d’autres personnes et, le cas échéant, à effectuer des recherches scientifiques et du développement expérimental se rapportant à de tels titres."]
["Pour évaluer au préalable si la société respecte le critère relatif au 75 % d'activités, veuillez indiquer les informations demandées ci-dessous."]
[]
["Nom de la société",null,"No dossier IQ"]
[{"$f":"IF(Demande!A7=\"\",\"\",Demande!A7)","v":""},null,{"$f":"IF(Demande!U10=\"\",\"\",Demande!U10)","v":""}]
[]
["Méthode basée sur la masse salariale (activités du Québec uniquement)"]
["Énumérez et additionnez tous les postes de salaires qui figurent à la balance de vérification pour l'exercice financier visé."]
["Bien que les calculs de la présente annexe soient basés sur les salaires, Investissement Québec pourra accepter toute autre méthode raisonnable présentée par la société (par exemples les heures travaillées ou méthode basée sur les revenus) pour établir le ratio du 75 % d'activités."]
[]
["Nom du compte de la balance de vérification (salaires, bonis, temps supplémentaires.)","# de compte de grand livre","Montant pour l'exercice financier"]
[]
[]
[]
[]
[]
[]
{"$rows_left_out":20}
{"sheet":"Annexe G","index":8,"n_rows":9,"n_cols":4,"rows_kept":9,"cut":false,"hidden":false,"merged":[[30,0,30,1],[31,0,31,1],[22,0,22,1],[23,0,23,1],[24,0,24,1],[25,0,25,1],[26,0,26,1],[27,0,27,1],[28,0,28,1],[29,0,29,1],[19,0,19,1],[20,0,20,1],[9,2,9,4],[10,2,10,4],[11,2,11,4],[12,2,12,4],[13,2,13,4],[14,2,14,4],[15,2,15,4],[16,2,16,4],[17,2,17,4],[18,2,18,4],[0,2,0,4],[21,0,21,1],[9,0,9,1],[10,0,10,1],[11,0,11,1],[12,0,12,1],[13,0,13,1],[14,0,14,1],[15,0,15,1],[16,0,16,1],[17,0,17,1],[18,0,18,1],[19,2,19,4],[20,2,20,4],[8,0,8,1],[8,2,8,4],[7,0,7,2],[2,0,2,4],[3,0,3,4],[6,0,6,1],[1,0,1,4],[32,0,32,1],[33,0,33,1],[34,0,34,1],[35,0,35,1],[36,0,36,1],[37,0,37,1],[38,0,38,1],[39,0,39,1],[40,0,40,1],[41,0,41,1],[42,0,42,1],[43,0,43,1],[44,0,44,1],[45,0,45,1],[46,0,46,1],[47,0,47,1],[48,0,48,1],[49,0,49,1],[50,0,50,1],[51,0,51,1],[21,2,21,4],[22,2,22,4],[23,2,23,4],[24,2,24,4],[25,2,25,4],[26,2,26,4],[27,2,27,4],[28,2,28,4],[29,2,29,4],[30,2,30,4],[31,2,31,4],[32,2,32,4],[33,2,33,4],[34,2,34,4],[35,2,35,4],[36,2,36,4],[37,2,37,4],[38,2,38,4],[39,2,39,4],[40,2,40,4],[41,2,41,4],[42,2,42,4],[43,2,43,4],[44,2,44,4],[45,2,45,4],[51,2,51,4],[46,2,46,4],[47,2,47,4],[48,2,48,4],[49,2,49,4],[50,2,50,4]]}
[null,null,"Production de titres multimédias\n(volet sociétés spécialisées)\nVersion : 2023-09-22"]
["Annexe G - Demande d'attestation de société spécialisée\nNom des titres exclus"]
["(L'Annexe G fait partie intégrante de la présente demande.)"]
["Vous devez fournir une liste des titres multimédias exclus. Un titre multimédia exclu est un titre qui ne satisfait pas les critères d'admissibilité prévus au chapitre 6 de l'annexe A de la Loi concernant les paramètres sectoriels de certaines mesures fiscales."]
[]
["Nom de la société",null,null,"No dossier IQ"]
[{"$f":"IF(Demande!A7=\"\",\"\",Demande!A7)","v":""},null,null,{"$f":"IF(Demande!U10=\"\",\"\",Demande!U10)","v":""}]
[]
["Nom des titres multimédias exclus",null,"Nom du client"]

{"sheet":"Annexe H","index":9,"n_rows":9,"n_cols":3,"rows_kept":9,"cut":false,"hidden":false,"merged":[[1,0,1,2],[2,0,2,2],[3,0,3,2],[7,0,7,1],[0,1,0,2]]}
[null,"Production de titres multimédias\n(volet sociétés spécialisées)\nVersion : 2023-09-22"]
["Annexe H - Employés non réclamés de l'établissement au Québec"]
["(L'Annexe H fait partie intégrante de la présente demande.)"]
["Veuillez fournir la liste des employés que la société n'a pas réclamés pour son établissement au Québec, le titre de leur poste ainsi que leur salaire brut versé durant l'exercice financier."]
[]
["Nom de la société",null,"No dossier IQ"]
[{"$f":"IF(Demande!A7=\"\",\"\",Demande!A7)","v":""},null,{"$f":"IF(Demande!U10=\"\",\"\",Demande!U10)","v":""}]
[]
["Nom de l'employé non réclamé","Titre du poste occupé","Salaire brut pour l'exercice"]