{"text_format":"1","workbook":"xlsx","n_sheets":6,"sheets":["Instructions","Renseignements à compléter","Année 1 - à compléter","Année 2 - à compléter","Calculs","Feuil1"],"not_rendered":{"charts":0,"images":5,"macros":0,"external_links":0,"defined_names":39,"comments":4,"pivot_tables":0},"unopened":[],"bounds":{"document_bytes":16777216,"sheet_cells":100000,"rows_first":2000,"rows_last":500,"rows_between":2000,"halvings":0,"cell_chars":16384,"cell_head_chars":4096},"cells_cut":0,"cells_raw":0,"read":"whole","date_system":"1900"}

{"sheet":"Instructions","index":0,"n_rows":161,"n_cols":5,"rows_kept":161,"cut":false,"hidden":false,"merged":[[161,1,161,2],[160,1,160,2],[1,2,1,4],[99,1,99,2],[2,1,2,2],[3,1,3,2],[77,0,77,3],[86,1,86,2],[84,1,84,2]]}
[null,null,null,null,"Financement des crédits d'impôt remboursables relatifs :"]
[null,null," ̶  à l'économie du savoir\n ̶  aux entreprises de la presse d'information écrite"]
[null,"DEMANDE DE GARANTIE / PRÊT"]
[null,"Instructions"]
[]
[]
[]
[]
[]
[]
[]
[]
[]
[]
[]
[]
[]
[]
[]
[]
{"$rows_left_out":142}
{"sheet":"Renseignements à compléter","index":1,"n_rows":170,"n_cols":59,"rows_kept":170,"cut":false,"hidden":false,"merged":[[167,16,168,16],[1,8,1,16],[67,1,67,9],[50,1,50,5],[50,6,50,15],[120,1,120,2],[120,3,120,5],[120,6,120,8],[120,9,120,10],[120,11,120,12],[120,13,120,15],[118,1,118,2],[118,3,118,5],[118,6,118,8],[118,9,118,10],[118,11,118,12],[118,13,118,15],[119,1,119,2],[119,3,119,5],[119,6,119,8],[119,9,119,10],[119,11,119,12],[119,13,119,15],[17,6,17,8],[40,6,40,15],[94,2,94,14],[41,6,41,15],[54,1,54,5],[39,6,39,15],[30,5,30,15],[31,5,31,15],[32,1,32,5],[34,1,34,5],[38,1,38,5],[33,9,33,15],[35,11,35,15],[36,11,36,15],[35,3,35,7],[37,11,37,15],[99,2,99,13],[58,13,58,15],[43,6,43,8],[57,6,57,8],[59,0,59,16],[58,6,58,8],[57,13,57,15],[47,1,47,16],[123,1,123,2],[92,2,93,14],[121,6,121,8],[123,6,123,8],[121,3,121,5],[122,3,122,5],[123,3,123,5],[114,5,114,15],[103,1,103,15],[63,1,63,9],[60,1,60,9],[87,2,87,9],[43,13,43,15],[54,6,54,15],[74,11,74,13],[122,6,122,8],[159,12,160,13],[79,4,79,8],[79,12,79,15],[74,14,74,15],[77,10,77,15],[70,1,70,16],[75,4,75,10],[72,6,72,15],[74,4,74,10],[121,1,121,2],[122,1,122,2],[122,13,122,15],[123,13,123,15],[150,8,150,9],[152,8,152,9],[154,8,154,9],[150,6,150,7],[121,11,121,12],[122,11,122,12],[123,11,123,12],[80,12,80,15],[151,10,152,11],[100,7,100,9],[149,14,150,15],[164,1,164,5],[83,1,83,15],[0,0,0,2],[2,0,2,16],[3,0,3,16],[29,5,29,15],[26,5,26,15],[27,5,27,15],[15,11,15,13],[25,5,25,15],[17,11,17,13],[4,1,4,7],[15,4,15,5],[22,7,22,15],[23,7,23,15],[20,1,20,16],[4,11,4,12],[8,1,8,5],[11,2,11,14],[15,6,15,8],[16,6,16,8],[13,10,13,14],[16,11,16,13],[0,8,0,16],[167,1,167,5],[157,10,158,11],[155,10,156,11],[163,10,164,11],[155,14,156,15],[167,12,168,13],[165,10,166,11],[163,1,163,5],[155,1,155,5],[162,1,162,5],[168,6,168,7],[158,6,158,7],[160,6,160,7],[162,6,162,7],[164,6,164,7],[166,6,166,7],[161,6,161,9],[163,6,163,9],[156,8,156,9],[158,8,158,9],[160,8,160,9],[162,8,162,9],[164,8,164,9],[165,1,165,5],[169,14,169,15],[165,14,166,15],[163,14,164,15],[161,10,162,11],[165,12,166,13],[163,12,164,13],[95,2,95,15],[96,2,96,15],[116,1,117,2],[116,3,117,5],[116,6,117,8],[116,9,117,10],[121,9,121,10],[122,9,122,10],[155,12,156,13],[149,6,149,9],[151,6,151,9],[153,6,153,9],[161,1,161,5],[167,14,168,15],[168,1,168,5],[166,1,166,5],[167,10,168,11],[148,1,148,5],[109,4,110,5],[109,8,110,14],[158,1,158,5],[116,13,117,15],[116,11,117,12],[121,13,121,15],[109,1,109,3],[156,1,156,5],[157,14,158,15],[168,8,168,9],[165,6,165,9],[167,6,167,9],[166,8,166,9],[121,22,124,37],[151,16,152,16],[153,16,154,16],[161,16,162,16],[163,16,164,16],[165,16,166,16],[161,14,162,15],[149,10,150,11],[126,1,126,16],[161,12,162,13],[153,1,153,5],[153,12,154,13],[151,12,152,13],[153,14,154,15],[151,1,151,5],[152,1,152,5],[153,10,154,11],[149,1,149,5],[155,16,156,16],[149,12,150,13],[157,16,158,16],[159,16,160,16],[123,9,123,10],[151,14,152,15],[159,1,159,5],[149,16,150,16],[148,6,148,9],[146,1,146,16],[160,1,160,5],[157,1,157,5],[155,6,155,9],[157,6,157,9],[159,6,159,9],[157,12,158,13],[154,1,154,5],[150,1,150,5],[148,14,148,15],[148,10,148,11],[148,12,148,13],[159,10,160,11],[159,14,160,15],[152,6,152,7],[154,6,154,7],[156,6,156,7]]}
[null,null,null,null,null,null,null,null,"  Financement des crédits d'impôt remboursables relatifs :"]
[null,null,null,null,null,null,null,null," ̶  à l'économie du savoir\n– aux entreprises de la presse d'information écrite    "]
["DEMANDE DE GARANTIE / PRÊT"]
["Renseignements généraux",null,null,null,null,null,null,null,null,null,null,null,null,null,null,null,null,null,null,null,null,null,"++++++++++     (Cliquez ici pour choisir le crédit d'impôt)     ++++++++++"]
[null,{"$f":"H23","v":0},null,null,null,null,null,null,null,null,null,null,null,null,null,null,null,null,null,null,null,null,"Développement des affaires électroniques (CDAE) - Mesure fiscale permanente"]
[null,null,null,null,null,null,null,null,null,null,null,null,null,null,null,null,null,null,null,null,null,null,"Production de titres multimédias (PTM) – Mesure fiscale permanente"]
[null,null,null,null,null,null,null,null,null,null,null,null,null,null,null,null,null,null,null,null,null,null,"Services d’adaptation technologique (SAT) – Mesure fiscale permanente"]
[null,null,null,null,null,null,null,null,null,null,null,null,null,null,null,null,null,null,null,null,null,null,"Pour appuyer à la transformation numérique des entreprises de la presse d'information écrite (CTNP) - Échéance le 31 décembre 2023"]
[null,"CHOIX DU CRÉDIT D'IMPÔT À FINANCER",null,null,null,null,null,null,null,null,null,null,null,null,null,null,null,null,null,null,null,null,"Soutien à la presse d'information écrite (CPIE)"]
[null,null,null,null,null,null,null,null,null,null,null,null,null,null,null,null,null,null,null,null,null,null,"Crédit d’impôt pour la main-d’œuvre journalistique canadienne (CMOJC)"]
[null,null,null,null,null,null,null,null,null,null,null,null,null,null,null,null,null,null,null,null,null,null,{"$f":"C12","v":"++++++++++     (Cliquez ici pour choisir le crédit d'impôt)     ++++++++++"}]
[null,null,"++++++++++     (Cliquez ici pour choisir le crédit d'impôt)     ++++++++++"]
[]
[null,null,"Exercice financier visé :",null,null,null,null,"1er exercice",null,null,"2e exercice (au besoin)"]
[null,null,null,null,null,null,null,null,null,null,null,null,null,null,null,null,null,null,null,null,null,null,null,null,null,null,null,null,null,null,null,null,null,null,null,null,null,null,null,null,null,null,null,null,null,null,null,null,null,null,null,null,null,null,null,null,null,"Année 1","Année 2"]
[null,null,null,null,"Date de début :",null,null,null,null,null,null,null,null,null,null,null,null,null,null,null,null,null,null,null,null,null,null,null,null,null,null,null,null,null,null,null,null,null,null,null,null,null,null,null,null,null,null,null,null,null,null,null,null,null,"Nombre de jours dans l'exercice",null,null,{"$f":"MAX(MIN(IF(NOT(OR(ISBLANK(G17),ISBLANK(G16))),G17-G16+1,0),365),0)","v":0},{"$f":"MAX(0,(MIN(IF(NOT(OR(ISBLANK(L17),ISBLANK(L16))),L17-L16+1,0),365)))","v":0}]
[null,null,null,null,"Date de fin :"]
[null,null,null,null,null,null,"(aaaa-mm-jj)",null,null,null,null,"(aaaa-mm-jj)"]
[]
[]
{"$rows_left_out":151}
{"sheet":"Année 1 - à compléter","index":2,"n_rows":500,"n_cols":41,"rows_kept":500,"cut":false,"hidden":false,"merged":[[15,1,15,8],[0,0,0,2],[9,2,9,8],[13,2,13,8],[5,1,5,2],[10,2,12,8],[4,0,4,8],[3,0,3,8],[1,5,1,8],[2,5,2,8],[41,1,41,7],[24,1,24,2],[26,1,26,2],[25,1,25,2],[27,1,27,2],[29,1,29,2],[35,1,36,7],[32,1,32,4],[33,1,33,4],[23,1,23,2],[31,1,31,2],[20,1,20,2],[21,1,21,2],[22,1,22,2],[17,1,17,5],[28,1,28,2],[40,1,40,2],[129,14,130,14],[44,6,45,6],[46,1,46,2],[44,1,45,1],[44,2,45,2],[30,1,30,2],[44,8,45,8],[44,4,45,4],[44,5,45,5],[18,1,18,2],[44,3,45,3],[44,7,45,7],[19,1,19,2]]}
[]
[null,null,null,null,null,"Financement des crédits d'impôt remboursables relatifs :",null,null,null,null,null,null,null,null,null,null,null,{"$f":"J21","v":0}]
[null,null,null,null,null," ̶  à l'économie du savoir\n– aux entreprises de la presse d'information écrite"]
["DEMANDE DE GARANTIE / PRÊT"]
["Calculs relatifs aux crédit d'impôts à financer (année 1)"]
[null,{"$f":"'Renseignements à compléter'!H23","v":0},null,null,null,null,{"$f":"'Renseignements à compléter'!J5&'Renseignements à compléter'!L5","v":""},null,{"$f":"'Renseignements à compléter'!O5&'Renseignements à compléter'!P5","v":""}]
[]
["1.","ÉVALUATION DES CRÉDITS D'IMPÔT À FINANCER",null,null,null,null,null,null,null,null,"(SAUF PTM,SAT,CDB et CDAE)"]
[null,null,null,null,null,null,null,null,null,null,"Aucun crédit d'impôt sélectionné","Veuillez sélectionner le crédit d'impôt visé par la présente demande à l'onglet Renseignements à compléter"]
[null,"Crédit d'impôt visé :",{"$f":"IF('Renseignements à compléter'!W11=\"++++++++++     (Cliquez ici pour choisir le crédit d'impôt)     ++++++++++\",\"Aucun crédit d'impôt sélectionné\",'Renseignements à compléter'!W11)","v":"Aucun crédit d'impôt sélectionné"},null,null,null,null,null,null,null,"Développement des affaires électroniques (CDAE) - Mesure fiscale permanente"]
[null,null,{"$f":"VLOOKUP($C$10,$K$9:$L$21,2,FALSE)","v":"Veuillez sélectionner le crédit d'impôt visé par la présente demande à l'onglet Renseignements à compléter"},null,null,null,null,null,null,null,"Production de titres multimédias (PTM) – Mesure fiscale permanente"]
[null,null,null,null,null,null,null,null,null,null,"Services d’adaptation technologique (SAT) – Mesure fiscale permanente","Une dépense n'est pas admissible au crédit d'impôt SAT si cette dépense est admissible aux crédits suivants: crédit d'impôt relatif aux salaires R-D, crédits d'impôt pour la recherche universitaire ou la recherche effectuée par un centre de recherche publique ou consortium de recherche ou pour la recherche précompétitive en partenariat privé."]
[null,"Endroit où seront",null,null,null,null,null,null,null,null,"Pour appuyer à la transformation numérique des entreprises de la presse d'information écrite (CTNP) - échéance le 31 décembre 2023"]
[null,"réalisées les activités :",null,null,null,null,null,null,null,null,"Soutien à la presse d'information écrite (CPIE)","Le salaire admissible doit être réduit de toute aide gouvernementale sauf un montant réputé payé au titre de l'impôt fédéral sur le revenu en application du crédit d'impôt remboursable pour la main-d'œuvre accordé à une organisation journalistique admissible."]
[null,null,null,null,null,null,null,null,null,null,"Crédit d’impôt pour la main-d’œuvre journalistique canadienne (CMOJC)","Le crédit MOJC est applicable à partir du 1er janvier 2019. Le salaire admissible doit être réduit par tout montant d'aide reçu par l'organisation ou qu'elle peut raisonnablement s'attendre à recevoir relativement aux salaires ou traitements payables pour cet employé pour l'année d'imposition. Par exemple, un crédit d'impôt provincial obtenu sur la même dépense de main-d'oeuvre admissible serait généralement considéré comme un montant d'aide."]
[null,"Note : Le tableau de la section 2 ci-dessous doit être utilisé pour établir les coûts relatifs aux salaires. (Sauf pour le crédit SAT)"]
[]
[null,{"$f":"IF(C10=N26,\"Exercise financier \",CONCATENATE(\"Exercice financier \",IF(AND('Renseignements à compléter'!G16<>0,'Renseignements à compléter'!G17<>0),(CONCATENATE(\"(du \",YEAR('Renseignements à compléter'!G16),\"-\",IF(MONTH('Renseignements à compléter'!G16)<10,CONCATENATE(\"0\",MONTH('Renseignements à compléter'!G16)),MONTH('Renseignements à compléter'!G16)),\"-\",IF(DAY('Renseignements à compléter'!G16)<10,CONCATENATE(\"0\",DAY('Renseignements à compléter'!G16)),DAY('Renseignements à compléter'!G16)),\" au \",YEAR('Renseignements à compléter'!G17),\"-\",IF(MONTH('Renseignements à compléter'!G17)<10,CONCATENATE(\"0\",MONTH('Renseignements à compléter'!G17)),MONTH('Renseignements à compléter'!G17)),\"-\",IF(DAY('Renseignements à compléter'!G17)<10,CONCATENATE(\"0\",DAY('Renseignements à compléter'!G17)),DAY('Renseignements à compléter'!G17)),\")\")),\"(du ______________ au _____________ )\")))","v":"Exercice financier (du ______________ au _____________ )"},null,null,null,null,null,null,null,null,null,null,null,"Colonne 1","Colonne 2","Colonne 3","Colonne 4","Colonne 5","Colonne 6","Colonne 7","Colonne 8","Colonne 9","Colonne 10","Colonne 11","Colonne 12","Colonne 13","Colonne 14","Colonne 15","Colonne 16","Colonne 17","Colonne 18","Colonne 19","Colonne 20","Colonne 21","Colonne 22","Colonne 23","Colonne 24","Colonne 25","Colonne 26","Colonne 27","Colonne 28"]
[null,{"$f":"VLOOKUP($C$10,$N$19:$AM$31,1,FALSE)","v":"Aucun crédit d'impôt sélectionné"},null,"Coûts admissibles ($)","% Crédits d'impôt applicables","Crédits d'impôt à financer ($)",null,null,null,null,null,null,null,"Aucun crédit d'impôt sélectionné","Aucun crédit d'impôt sélectionné"]
[null,{"$f":"VLOOKUP($C$10,$N$19:$AM$25,3,FALSE)","v":0},null,{"$f":"G47","v":0},{"$f":"VLOOKUP($C$10,N$19:AM$25,4,FALSE)","v":0},{"$f":"(D20*E20)","v":0},null,null,null,null,null,null,null,"Développement des affaires électroniques (CDAE) - Mesure fiscale permanente","CDAE (attestation requise)\nNote: Seule la portion remboursable du crédit d'impôt peut faire l'objet d'un financement.","Salaires admissibles",0.24,"- moins: Salaires admissibles engagés relatifs aux contrats gouvernementaux non admissibles conclus/renouvelés après le 30 septembre 2015 (s'ils sont inclus à la ligne précédente)",-0.24,"- moins: Aide gouvernementale ou non gouvernementale",-0.24,null,null,null,null,null,null,null,null,null,null,null,null,null,null,null,null,null,null,"83 333 $",83333]
{"$rows_left_out":481}
{"sheet":"Année 2 - à compléter","index":3,"n_rows":500,"n_cols":41,"rows_kept":500,"cut":false,"hidden":false,"merged":[[33,1,33,4],[34,1,34,4],[45,8,46,8],[47,1,47,2],[129,14,130,14],[42,1,42,7],[45,1,46,1],[45,2,46,2],[45,3,46,3],[45,4,46,4],[45,5,46,5],[45,6,46,6],[45,7,46,7],[19,1,19,2],[41,1,41,2],[32,1,32,2],[36,1,37,7],[20,1,20,2],[21,1,21,2],[22,1,22,2],[23,1,23,2],[24,1,24,2],[25,1,25,2],[26,1,26,2],[27,1,27,2],[28,1,28,2],[29,1,29,2],[30,1,30,2],[31,1,31,2],[10,2,10,8],[11,2,13,8],[14,2,14,8],[16,1,16,8],[18,1,18,5],[0,0,0,2],[4,0,4,8],[5,0,5,8],[6,1,6,2],[3,5,3,8]]}
[]
[null,null,null,null,null,null,null,null,"Financement des crédits d'impôt remboursables relatifs :  ",null,null,null,null,null,null,null,null,{"$f":"J22","v":0}]
[null,null,null,null,null,null,null,null," ̶  à l'économie du savoir  "]
[null,null,null,null,null," – aux entreprises de la presse d'information écrite  "]
["DEMANDE DE GARANTIE / PRÊT"]
["Calculs relatifs aux crédit d'impôts à financer (année 2)"]
[null,{"$f":"'Renseignements à compléter'!H23","v":0},null,null,null,null,{"$f":"'Renseignements à compléter'!J5&'Renseignements à compléter'!L5","v":""},null,{"$f":"'Renseignements à compléter'!O5&'Renseignements à compléter'!P5","v":""}]
[]
["1.","ÉVALUATION DES CRÉDITS D'IMPÔT À FINANCER",null,null,null,null,null,null,null,null,"(SAUF PTM,SAT,CDB et CDAE)"]
[null,null,null,null,null,null,null,null,null,null,"Aucun crédit d'impôt sélectionné","Veuillez sélectionner le crédit d'impôt visé par la présente demande à l'onglet Renseignements à compléter"]
[null,"Crédit d'impôt visé :",{"$f":"IF('Renseignements à compléter'!W11=\"++++++++++     (Cliquez ici pour choisir le crédit d'impôt)     ++++++++++\",\"Aucun crédit d'impôt sélectionné\",'Renseignements à compléter'!W11)","v":"Aucun crédit d'impôt sélectionné"},null,null,null,null,null,null,null,"Développement des affaires électroniques (CDAE) - Mesure fiscale permanente"]
[null,null,{"$f":"VLOOKUP($C$11,$K$10:$L$22,2,FALSE)","v":"Veuillez sélectionner le crédit d'impôt visé par la présente demande à l'onglet Renseignements à compléter"},null,null,null,null,null,null,null,"Production de titres multimédias (PTM) – Mesure fiscale permanente"]
[null,null,null,null,null,null,null,null,null,null,"Services d’adaptation technologique (SAT) – Mesure fiscale permanente","Une dépense n'est pas admissible au crédit d'impôt SAT si cette dépense est admissible aux crédits suivants: crédit d'impôt relatif aux salaires R-D, crédits d'impôt pour la recherche universitaire ou la recherche effectuée par un centre de recherche publique ou consortium de recherche ou pour la recherche précompétitive en partenariat privé."]
[null,"Endroit où seront",null,null,null,null,null,null,null,null,"Carrefours de la nouvelle économie (CNE) – Échéance le 2013-12-31","Veuillez noter que ce crédit ne peut être réclamé si le CDAE est réclamé et ce également pour toute société associée"]
[null,"réalisées les activités :",null,null,null,null,null,null,null,null,"Cité du multimédia (CMM) – Échéance le 2013-12-31","Veuillez noter que ce crédit ne peut être réclamé si le CDAE est réclamé et ce également pour toute société associée"]
[null,null,null,null,null,null,null,null,null,null,"Centre national des nouvelles technologies de Québec (CNNTQ) – Échéance le 2013-12-31","Veuillez noter que ce crédit ne peut être réclamé si le CDAE est réclamé et ce également pour toute société associée"]
[null,"Note : Le tableau de la section 2 ci-dessous doit être utilisé pour établir les coûts relatifs aux salaires. (Sauf pour le crédit SAT)",null,null,null,null,null,null,null,null,"Centres de développement des technologies de l’information (CDTI) – Échéance le 2013-12-31","Veuillez noter que ce crédit ne peut être réclamé si le CDAE est réclamé et ce également pour toute société associée"]
[null,null,null,null,null,null,null,null,null,null,"Centres de développement des biotechnologies (CDB) - Échéance le 2013-12-31"]
[null,{"$f":"IF(C11=N27,\"Exercise financier \",CONCATENATE(\"Exercice financier \",IF(AND('Renseignements à compléter'!L16<>0,'Renseignements à compléter'!L17<>0),(CONCATENATE(\"(du \",YEAR('Renseignements à compléter'!L16),\"-\",IF(MONTH('Renseignements à compléter'!L16)<10,CONCATENATE(\"0\",MONTH('Renseignements à compléter'!L16)),MONTH('Renseignements à compléter'!L16)),\"-\",IF(DAY('Renseignements à compléter'!L16)<10,CONCATENATE(\"0\",DAY('Renseignements à compléter'!L16)),DAY('Renseignements à compléter'!L16)),\" au \",YEAR('Renseignements à compléter'!L17),\"-\",IF(MONTH('Renseignements à compléter'!L17)<10,CONCATENATE(\"0\",MONTH('Renseignements à compléter'!L17)),MONTH('Renseignements à compléter'!L17)),\"-\",IF(DAY('Renseignements à compléter'!L17)<10,CONCATENATE(\"0\",DAY('Renseignements à compléter'!L17)),DAY('Renseignements à compléter'!L17)),\")\")),\"(du ______________ au _____________ )\")))","v":"Exercice financier (du ______________ au _____________ )"},null,null,null,null,null,null,null,null,"Cité du commerce électronique (CCE) – Échéance le 2013-12-31","Veuillez noter que ce crédit ne peut être réclamé si le CDAE est réclamé et ce également pour toute société associée",null,"Colonne 1","Colonne 2","Colonne 3","Colonne 4","Colonne 5","Colonne 6","Colonne 7","Colonne 8","Colonne 9","Colonne 10","Colonne 11","Colonne 12","Colonne 13","Colonne 14","Colonne 15","Colonne 16","Colonne 17","Colonne 18","Colonne 19","Colonne 20","Colonne 21","Colonne 22","Colonne 23","Colonne 24","Colonne 25","Colonne 26","Colonne 27","Colonne 28"]
[null,{"$f":"VLOOKUP($C$11,$N$20:$AM$32,2,FALSE)","v":"Aucun crédit d'impôt sélectionné"},null,"Coûts admissibles ($)","% Crédits d'impôt applicables","Crédits d'impôt à financer ($)",null,null,null,null,"Pour appuyer à la transformation numérique des entreprises de la presse d'information écrite  (CTNP) - échéance le 31 décembre 2023",null,null,"Aucun crédit d'impôt sélectionné","Aucun crédit d'impôt sélectionné"]
{"$rows_left_out":481}
{"sheet":"Calculs","index":4,"n_rows":173,"n_cols":21,"rows_kept":173,"cut":false,"hidden":true,"merged":[[14,2,14,3],[5,2,5,16],[7,3,7,16],[0,7,0,15],[0,1,0,5],[2,0,2,16],[3,0,3,16],[13,2,13,3],[16,2,16,10],[19,2,19,4],[163,10,163,12],[149,10,149,12],[30,8,30,10],[22,3,22,15],[23,3,23,15],[35,2,35,15],[56,2,56,16],[147,2,147,16],[161,2,161,16],[31,8,31,10]]}
[null,null,null,null,null,null,null,"Financement des crédits d'impôt remboursables à la R & D"]
[]
["SCHÉMA D'ANALYSE"]
["Calculs relatifs aux crédits d'impôt à financer"]
[]
[null,null,"1.  ADMISSIBILITÉ AUX CRÉDITS D'IMPÔT REMBOURSABLES"]
[]
[null,null,"1.1"," Admissibilité aux crédits d'impôt remboursables (Québec)"]
[]
[null,null,null,"Date de la fin du premier exercice financier financé :"]
[null,null,null,"Date de la fin du deuxième exercice financier financé :"]
[]
[]
[null,null,"Actifs de :",null,null,null,null,"$","*",null,"en date du :",null,{"$f":"IF(M10=\"\",\"\",IF(M10>DATE(2005,2,28),M10-365,IF(M10<DATE(2004,2,29),M10-365,IF(M10=\"\",0,M10-366))))","v":""}]
[null,null,"Actifs de :",null,null,null,null,"$","*",null,"en date du :",null,{"$f":"IF(M11=\"\",\"\",IF(M11>DATE(2005,2,28),M11-365,IF(M11<DATE(2004,2,29),M11-365,IF(M11=\"\",0,M11-366))))","v":""}]
[]
[null,null,"* : Y compris les actifs des corporations associées, s'il y a lieu",null,null,null,null,null,null,null,null,null,null,null,null,null,null,null,null,1,0.375]
[null,null,null,null,null,null,null,null,null,null,null,null,null,null,null,null,null,null,null,25000000,0.33500000000000002]
[null,null,"Taux de calcul des crédits d'impôt à la R & D sur dépenses admissibles nettes n'excédant pas 2 millions $:",null,null,null,null,null,null,null,null,null,null,null,null,null,null,null,null,30000000,0.29499999999999998]
[null,null,"année teminée:",null,null,null,{"$f":"IF((K39>0),(K39),0)","v":""},":",{"$f":"IF(G14=\"\",\"\",IF(G14>0,VLOOKUP(G14,T17:U22,2),IF(G14<25000000,0.375,0)))","v":""},null,{"$f":"IF((M39>0),(M39),0)","v":""},":",{"$f":"IF(G15=\"\",\"\",IF(G15>0,VLOOKUP(G15,T17:U22,2),IF(G15<25000000,0.375,0)))","v":""},null,null,null,null,null,null,35000000,0.27500000000000002]
{"$rows_left_out":154}
{"sheet":"Feuil1","index":5,"n_rows":8,"n_cols":2,"rows_kept":8,"cut":false,"hidden":true,"merged":[]}
[]
[]
[null,"Président"]
[null,"Vice-Président"]
[null,"Directeur"]
[null,"Superviseur"]
[null,"Contrôleur"]
[null,"Autre"]